Error lnk2019 unresolved external symbol protected void thiscall

1 Windows package. These libraries are usually built as part of OpenCV library and you don' t need to install them separately. So you can build OpenCV from sources yourself or use dynamic. error LNK: unresolved external symbol referenced in function ' " protected: void _ _ thiscall cocos2d: : Console: : loop( void) " (? [email protected] 4> cocos2d. obj) : error LNK:. The error was because I copied the CResizableDialog. h and CResizableDialog. cpp files directly into the project folder. I later noticed that they didn' t show up in the solution window and copied them to the window as well. obj : error LNK: unresolved external symbol referenced in function " private: void _ _ thiscall BoxApp: : BuildFX( void) " (? obj : error LNK: unresolved external symbol. error LNK: unresolved external symbol referenced in function " protected: bool _ _ thiscall.

  • Exception in thread main java lang runtimeexception cannot find kiemodule
  • Neverwinter direct3d error fix
  • Error 651 el modem u otro dispositivo
  • How to fix decode error on youtube
  • Error 403 chrome android
  • Error 22 diablo 2 windows 7


  • Video:Thiscall protected error

    Symbol unresolved protected

    You have declared, and are calling, a function Login: : loginMenu - a member function of class Login - but you haven' t implemented it. You have implemented a function : : loginMenu - a non- member stand- alone function - but. Error 2 error LNK: unresolved external symbol " public: _ _ thiscall Signal: : Signal( void) " (? template < class T> class Signal { protected: int N; / / width of array int M; private: double deltaT; / / sampling period double t0;. Error 22 error LNK: unresolved external symbol _ [email protected] 12 referenced in function " protected: virtual int _ _ thiscall COpenTsrv: : OnInitDialog( void) " (? The " _ _ thiscall" is noise. The error messages are complaining about BankAccount: : BankAccount( void). The header file says that BankAccount has a default constructor, but there' s no definition for addition to adding the library path to the project setting be sure you also add the required library files(. lib) as an additional dependency for the linker. you can find the additional dependency input field at. This error often means that some function has a declaration, but not a definition.

    hpp class A { public: void myFunc( ) ; / / Function declaration } ; / / A. cpp / / Function definition void A: : myFunc( ) { / / do stuff }.